Target
Heat shock protein HSP 90-beta
Ligand
BDBM225746
Substrate
Meas. Tech.
ITC
Kd
10.7±3.53 nM
Citation
 D3R, DD AbbVie-CSAR HSP90 D3R 408:0 (2016) Target
Name:
Heat shock protein HSP 90-beta
Synonyms:
HS90B_HUMAN HSP 90 HSP90B HSPCB Heat shock protein HSP 90 (Hsp90)
Type:
Molecular Chaperone
Mol. Mass.:
83229.45
Organism:
Homo sapiens (Human)
Description:
P08238
Residue:
724
  
Inhibitor
Name:
BDBM225746
Synonyms:
hsp90_43
Type:
Small Organic Molecule
Emp. Form.:
C20H16ClN3O6S
Mol. Mass.:
461.876
SMILES:
Oc1cc(O)c(cc1Cl)-n1c2ccc(CNS(=O)(=O)c3ccccc3O)cc2[nH]c1=O
: