Target
Heat shock protein HSP 90-beta
Ligand
BDBM225813
Substrate
Meas. Tech.
FRET Assay
IC50
27.2±n/a nM
Citation
 D3R, DD AbbVie-CSAR HSP90 D3R 408:0 (2016) Target
Name:
Heat shock protein HSP 90-beta
Synonyms:
HS90B_HUMAN HSP 90 HSP90B HSPCB Heat shock protein HSP 90 (Hsp90)
Type:
Molecular Chaperone
Mol. Mass.:
83229.45
Organism:
Homo sapiens (Human)
Description:
P08238
Residue:
724
  
Inhibitor
Name:
BDBM225813
Synonyms:
hsp90_104
Type:
Small Organic Molecule
Emp. Form.:
C11H5Cl3N4
Mol. Mass.:
299.543
SMILES:
Nc1nc(Cl)c(C#N)c(n1)-c1ccc(Cl)cc1Cl
: