Target
Bile acid receptor
Ligand
BDBM50336386
Substrate
Meas. Tech.
Scintillation Proximity Assay (SPA)
pH
7.4±n/a
IC50
315±n/a nM
Comments
extracted
Citation
 D3R, DD Drug Design Data Resource Grand Challenge 2 Dataset: FXR - Farnesoid X Receptor D3R 882:0 (2017) Target
Name:
Bile acid receptor
Synonyms:
BAR FXR HRR1 NR1H4_HUMAN RIP14 Retinoid X receptor-interacting protein 14 | farnesoid x receptor
Type:
Nuclear Receptor
Mol. Mass.:
55916.24
Organism:
Homo sapiens (Human)
Description:
Q96RI1
Residue:
486
  
Inhibitor
Name:
BDBM50336386
Synonyms:
(S)-4-(2-(2-(4-chlorophenyl)-5,6-difluoro-1H-benzo[d]imidazol-1-yl)-2-cyclohexylacetamido)benzoic acid CHEMBL1615153 | FXR_53
Type:
Small organic molecule
Emp. Form.:
C28H24ClF2N3O3
Mol. Mass.:
523.958
SMILES:
OC(=O)c1ccc(NC(=O)[C@H](C2CCCCC2)n2c(nc3cc(F)c(F)cc23)-c2ccc(Cl)cc2)cc1
: