Target
Cyclin-dependent kinase 4/G1/S-specific cyclin-D1 [L188C]
Ligand
BDBM6280
Substrate
GST-Rb fusion protein
Meas. Tech.
CDKs Assay
IC50
8±n/a nM
Citation
 Barvian, MBoschelli, DHCossrow, JDobrusin, EFattaey, AFritsch, AFry, DHarvey, PKeller, PGarrett, MLa, FLeopold, WMcNamara, DQuin, MTrumpp-Kallmeyer, SToogood, PWu, ZZhang, E Pyrido[2,3-d]pyrimidin-7-one inhibitors of cyclin-dependent kinases. J Med Chem 43:4606-16 (2000)  
Target
Name:
Cyclin-dependent kinase 4/G1/S-specific cyclin-D1 [L188C]
Synonyms:
CDK4/Cyclin D | Cyclin-Dependent Kinase 4 (CDK4)
Type:
Protein Complex
Mol. Mass.:
Description:
CDK4/D complexes were purified from insect cells co-infected with baculovirus vectors containing each of the components.
Components:
This complex has 2 components.
Component 1
Name:
Cyclin-dependent kinase 4
Synonyms:
CDK4 Cell division protein kinase 4 PSK-J3
Type:
Enzyme Subunit
Mol. Mass.:
33731.96
Organism:
Homo sapiens (Human)
Description:
P11802
Residue:
303
  
Component 2
Name:
G1/S-specific cyclin-D1 [L188C]
Synonyms:
BCL1 CCND1_HUMAN PRAD1
Type:
Enzyme Subunit
Mol. Mass.:
33634.57
Organism:
Homo sapiens (Human)
Description:
P24385[L188C]
Residue:
295
  
Inhibitor
Name:
BDBM6280
Synonyms:
8-Bicyclo[2.2.1]hept-2-yl-2-{4-[4-(3-hydroxypropyl)piperidin-1-yl]phenylamino}-8H-pyrido[2,3-d]pyrimidin-7-one N8 Pyrido[2,3-d]pyrimidin-7-one deriv. 72 PD183812
Type:
Small organic molecule
Emp. Form.:
C28H35N5O2
Mol. Mass.:
473.6098
SMILES:
OCCCC1CCN(CC1)c1ccc(Nc2ncc3ccc(=O)n(C4CC5CCC4C5)c3n2)cc1
:
Substrate
Name:
GST-Rb fusion protein
Synonyms:
Glutathione S-transferase (GST)-retinoblastoma (Rb) fusion RB1 Rb | retinoblastoma
Type:
Other Protein Type
Mol. Mass.:
106410.17
Organism:
Homo sapiens (Human)
Description:
GST-60 kDa Rb fusion protein (comprising amino acids 378 to 928 of retinoblastoma)
Residue:
928