Target
Fatty acid-binding protein 5 [K24A,R33A,K34A]
Ligand
BDBM50152850
Substrate
Meas. Tech.
Ligand Binding Assay
pH
8.2±n/a
Temperature
303.15±n/a K
Ki
3.06e+3±n/a nM
Comments
extracted
Citation
 Armstrong, EHGoswami, DGriffin, PRNoy, NOrtlund, EA Structural basis for ligand regulation of the fatty acid-binding protein 5, peroxisome proliferator-activated receptor ß/d (FABP5-PPARß/d) signaling pathway. J Biol Chem 289:14941-54 (2014)  
Target
Name:
Fatty acid-binding protein 5 [K24A,R33A,K34A]
Synonyms:
FABP5 Fatty acid-binding protein 5 (FABP5)(NLSm)
Type:
Protein
Mol. Mass.:
14962.47
Organism:
Homo sapiens (Human)
Description:
Human FABP5 NLS-deficient mutant (K24A/K34A/R33A)
Residue:
135
  
Inhibitor
Name:
BDBM50152850
Synonyms:
1-HEXYLDECANOIC ACID Hexadecanoic acid Palmitic acid (PA)
Type:
Small organic molecule
Emp. Form.:
C16H32O2
Mol. Mass.:
256.4241
SMILES:
CCCCCCCCCCCCCCCC(O)=O
: