Target
Fatty acid-binding protein 5 [M35A,L60A]
Ligand
BDBM50152850
Substrate
Meas. Tech.
Ligand Binding Assay
pH
8.2±n/a
Temperature
303.15±n/a K
Ki
6.9e+2±n/a nM
Comments
extracted
Citation
 Armstrong, EHGoswami, DGriffin, PRNoy, NOrtlund, EA Structural basis for ligand regulation of the fatty acid-binding protein 5, peroxisome proliferator-activated receptor ß/d (FABP5-PPARß/d) signaling pathway. J Biol Chem 289:14941-54 (2014)  
Target
Name:
Fatty acid-binding protein 5 [M35A,L60A]
Synonyms:
FABP5 Fatty acid-binding protein 5 (FABP5)(DSm)
Type:
Protein
Mol. Mass.:
15062.59
Organism:
Homo sapiens (Human)
Description:
Human FABP5 "double-switch" mutant (M35A/L60A)
Residue:
135
  
Inhibitor
Name:
BDBM50152850
Synonyms:
1-HEXYLDECANOIC ACID Hexadecanoic acid Palmitic acid (PA)
Type:
Small organic molecule
Emp. Form.:
C16H32O2
Mol. Mass.:
256.4241
SMILES:
CCCCCCCCCCCCCCCC(O)=O
: