Target
Steroid 17-alpha-hydroxylase/17,20 lyase
Ligand
BDBM158474
Substrate
Meas. Tech.
CYP17-Lyase Assay
pH
7.5±n/a
IC50
1.9±n/a nM
Comments
extracted
Citation
 Bock, MGGaul, CGummadi, VRSengupta, S 17a-hydroxylase/C17,20-lyase inhibitors US Patent  US9339501 Publication Date 5/17/2016 
Target
Name:
Steroid 17-alpha-hydroxylase/17,20 lyase
Synonyms:
CP17A_HUMAN CYP17A1 Cytochrome P450 17A1 Cytochrome P450 C17 (CYP17) Cytochrome P450-C17 P450-C17 Steroid 17-alpha-Monooxygenase (CYP17) Steroid 17-alpha-monooxygenase | cytochrome P450 monooxygenase 17 alpha hydroxylase/17,20-lyase (CYP17)
Type:
Enzyme
Mol. Mass.:
57382.42
Organism:
Homo sapiens (Human)
Description:
E.coli expressing human CYP17
Residue:
508
  
Inhibitor
Name:
BDBM158474
Synonyms:
US9029399, 46A | US9339501, 46A
Type:
Small organic molecule
Emp. Form.:
C16H14Cl2N4O
Mol. Mass.:
349.215
SMILES:
Clc1cc(cc(Cl)n1)N1CCN(C1=O)c1cnccc1C1CC1
: