Target
Tyrosine-protein phosphatase non-receptor type 9 [277-582]
Ligand
BDBM231166
Substrate
Meas. Tech.
Enzyme Kinetic Assay
pH
7±n/a
IC50
270±70 nM
Comments
extracted
Citation
 Zhang, ZZhang, S Inhibitors of protein tyrosine phosphatases US Patent  US9340574 Publication Date 5/17/2016 
Target
Name:
Tyrosine-protein phosphatase non-receptor type 9 [277-582]
Synonyms:
PTN9_HUMAN Tyrosine-protein phosphatase non-receptor type 9 (PTP-MEG2)
Type:
Protein
Mol. Mass.:
35160.61
Organism:
Homo sapiens (Human)
Description:
residues 277-582
Residue:
306
  
Inhibitor
Name:
BDBM231166
Synonyms:
US9340574, 5
Type:
Small organic molecule
Emp. Form.:
C30H31BrF2IN4O7P
Mol. Mass.:
835.369
SMILES:
Cc1ccc(cc1Br)C(=O)NC(Cc1ccc(cc1)C(F)(F)P(O)(O)=O)C(=O)NC(CCCNC(=O)c1cccc(I)c1)C(N)=O
: