Target
Enoyl-[acyl-carrier-protein] reductase [NADPH] FabI
Ligand
BDBM231624
Substrate
Meas. Tech.
Inhibition Kinetics Assay
pH
7.5±n/a
Ki
196.5±22.2 nM
Comments
extracted
Citation
 Schiebel, JChang, AShah, SLu, YLiu, LPan, PHirschbeck, MWTareilus, MEltschkner, SYu, WCummings, JEKnudson, SEBommineni, GRWalker, SGSlayden, RASotriffer, CATonge, PJKisker, C Rational design of broad spectrum antibacterial activity based on a clinically relevant enoyl-acyl carrier protein (ACP) reductase inhibitor. J Biol Chem 289:15987-6005 (2014)  
Target
Name:
Enoyl-[acyl-carrier-protein] reductase [NADPH] FabI
Synonyms:
Enoyl-[acyl-carrier-protein] reductase [NADPH] FabI FABI_STAA8 fabI
Type:
Enzyme
Mol. Mass.:
28019.03
Organism:
Staphylococcus aureus
Description:
Q2FZQ3
Residue:
256
  
Inhibitor
Name:
BDBM231624
Synonyms:
PT191
Type:
Small organic molecule
Emp. Form.:
C17H21NO2
Mol. Mass.:
271.3541
SMILES:
CCCCCCc1ccc(Oc2ccccc2)c(=O)[nH]1
: