Target
Neutrophil elastase
Ligand
BDBM232327
Substrate
US9346794, MeOSuc-Ala-Ala-Pro-Val-AMC
Meas. Tech.
Human Neutrophil Elastase Assay
pH
7.5±n/a
Temperature
298.15±n/a K
IC50
<1±n/a nM
Comments
extracted
Citation
 Oost, TFiegen, DGnamm, C Substituted 4-pyridones and their use as inhibitors of neutrophil elastase activity US Patent  US9346794 Publication Date 5/24/2016 
Target
Name:
Neutrophil elastase
Synonyms:
Bone marrow serine protease Coagulation factor X ELANE Elastase HLE Leukocyte elastase Medullasin Neutrophil elastase (HNE) PMN elastase Trypsin
Type:
Enzyme
Mol. Mass.:
28532.38
Organism:
Homo sapiens (Human)
Description:
P08246
Residue:
267
  
Inhibitor
Name:
BDBM232327
Synonyms:
US9346794, 31 US9346794, 31B
Type:
Small organic molecule
Emp. Form.:
C27H28F2N4O3S
Mol. Mass.:
526.598
SMILES:
CCS(=O)(=NC#N)c1ccc(CNC(=O)c2cn(C(C)C)c(C)c(-c3cccc(c3)C(F)F)c2=O)cc1
:
Substrate
Name:
BDBM211682
Synonyms:
US9290457, MeOSuc-AAPV-AMC
Type:
Substrate
Emp. Form.:
C31H41N5O9
Mol. Mass.:
627.6853
SMILES:
COC(=O)CCC(=O)NC(C)C(=O)NC(C)C(=O)N1CCCC1C(=O)NC(C(C)C)C(=O)Nc1ccc2c(C)cc(=O)oc2c1
: