Target
Glutathione S-transferase P
Ligand
BDBM50186231
Substrate
Meas. Tech.
GST Assay
IC50
2.6e+4±n/a nM
Citation
 Mangoyi, RHayeshi, RNgadjui, BNgandeu, FBezabih, MAbegaz, BRazafimahefa, SRasoanaivo, PMukanganyama, S Glutathione transferase from Plasmodium falciparum--interaction with malagashanine and selected plant natural products. J Enzyme Inhib Med Chem 25:854-62 (2010)  
Target
Name:
Glutathione S-transferase P
Synonyms:
FAEES3 GST3 GSTP1-1 Glutathione S-transferase Glutathione S-transferase P Glutathione transferase (GST)
Type:
Enzyme
Mol. Mass.:
23353.53
Organism:
Homo sapiens (Human)
Description:
P09211
Residue:
210
  
Inhibitor
Name:
BDBM50186231
Synonyms:
(2,3-Dichloro-4-(2-methylene-1-oxobutyl)phenoxy)acetic acid ETHACRYNIC ACID Etacrinic acid Hydromedin [2,3-dichloro-4-(2-methylidenebutanoyl)phenoxy]acetic acid | jm5b01461, Compound 72
Type:
Small organic molecule
Emp. Form.:
C13H12Cl2O4
Mol. Mass.:
303.138
SMILES:
CCC(=C)C(=O)c1ccc(OCC(O)=O)c(Cl)c1Cl
: