Target
UDP-glucuronosyltransferase 1A1
Ligand
BDBM50090677
Substrate
β-estradiol
Meas. Tech.
UDP-glucuronosyltransferase Activity Assay
IC50
>3.00e+5±n/a nM
Citation
 Liu, YShe, MWu, ZDai, R The inhibition study of human UDP-glucuronosyltransferases with cytochrome P450 selective substrates and inhibitors. J Enzyme Inhib Med Chem 26:386-93 (2011)  
Target
Name:
UDP-glucuronosyltransferase 1A1
Synonyms:
Bilirubin-specific UDPGT isozyme 1 UD11_HUMAN UDP-glucuronosyltransferase 1-A UDPGT 1-1 UGT1 UGT1-01 UGT1A Uridine-5'-diphosphoglucuronosyltransferase 1A1 | hUG-BR1
Type:
Enzyme
Mol. Mass.:
59604.34
Organism:
Homo sapiens (Human)
Description:
P22309
Residue:
533
  
Inhibitor
Name:
BDBM50090677
Synonyms:
4-Amino-N-(2-phenyl-2H-pyrazol-3-yl)-benzenesulfonamide CHEMBL1109 Sulfabid US9180183, Sulfaphenazole
Type:
Small organic molecule
Emp. Form.:
C15H14N4O2S
Mol. Mass.:
314.362
SMILES:
Nc1ccc(cc1)S(=O)(=O)Nc1ccnn1-c1ccccc1
:
Substrate
Name:
BDBM17292
Synonyms:
(1S,10R,11S,14S,15S)-15-methyltetracyclo[8.7.0.0^{2,7}.0^{11,15}]heptadeca-2,4,6-triene-5,14-diol 17α-ethinylestradiol CHEMBL135 ESTRADIOL Ovocyclin US9040509, E2 US9561238, E2 [2,4,6,7-3H]-E2 [3H]]estradiol
Type:
Steroid
Emp. Form.:
C18H24O2
Mol. Mass.:
272.382
SMILES:
[H][C@@]12CC[C@H](O)[C@@]1(C)CC[C@]1([H])c3ccc(O)cc3CC[C@@]21[H]
: