Target
UDP-glucuronosyltransferase 1A4
Ligand
BDBM50048392
Substrate
Midazolam
Meas. Tech.
UDP-glucuronosyltransferase Activity Assay
IC50
1.52e+5± 2.7e+4 nM
Citation
 Liu, YShe, MWu, ZDai, R The inhibition study of human UDP-glucuronosyltransferases with cytochrome P450 selective substrates and inhibitors. J Enzyme Inhib Med Chem 26:386-93 (2011)  
Target
Name:
UDP-glucuronosyltransferase 1A4
Synonyms:
Bilirubin-specific UDPGT isozyme 2 GNT1 UDP-glucuronosyltransferase 1-4 UDP-glucuronosyltransferase 1A4 UGT-1D UGT1*4 UGT1.4 UGT1D hUG-BR2
Type:
Enzyme
Mol. Mass.:
60042.50
Organism:
Homo sapiens (Human)
Description:
P22310
Residue:
534
  
Inhibitor
Name:
BDBM50048392
Synonyms:
2-(tert-butylamino)-1-(3-chlorophenyl)propan-1-one BUPROPION HYDROCHLORIDE US9944618, Compound ID No. 176
Type:
Small organic molecule
Emp. Form.:
C13H18ClNO
Mol. Mass.:
239.741
SMILES:
CC(NC(C)(C)C)C(=O)c1cccc(Cl)c1
:
Substrate
Name:
BDBM21363
Synonyms:
12-chloro-9-(2-fluorophenyl)-3-methyl-2,4,8-triazatricyclo[8.4.0.0^{2,6}]tetradeca-1(10),3,5,8,11,13-hexaene CHEMBL655 Midazolam US20230416258, Compound Midazolam
Type:
Small organic molecule
Emp. Form.:
C18H13ClFN3
Mol. Mass.:
325.767
SMILES:
Cc1ncc2CN=C(c3ccccc3F)c3cc(Cl)ccc3-n12
: