Target
UDP-glucuronosyltransferase 1A4
Ligand
BDBM50121975
Substrate
Midazolam
Meas. Tech.
UDP-glucuronosyltransferase Activity Assay
IC50
1.66e+5± 1.8e+4 nM
Citation
 Liu, YShe, MWu, ZDai, R The inhibition study of human UDP-glucuronosyltransferases with cytochrome P450 selective substrates and inhibitors. J Enzyme Inhib Med Chem 26:386-93 (2011)  
Target
Name:
UDP-glucuronosyltransferase 1A4
Synonyms:
Bilirubin-specific UDPGT isozyme 2 GNT1 UDP-glucuronosyltransferase 1-4 UDP-glucuronosyltransferase 1A4 UGT-1D UGT1*4 UGT1.4 UGT1D hUG-BR2
Type:
Enzyme
Mol. Mass.:
60042.50
Organism:
Homo sapiens (Human)
Description:
P22310
Residue:
534
  
Inhibitor
Name:
BDBM50121975
Synonyms:
(6-Methoxy-quinolin-4-yl)-(5-vinyl-1-aza-bicyclo[2.2.2]oct-2-yl)-methanol CHEMBL1294 DURAQUIN QUINAGLUTE QUINATIME QUINIDINE US9402878, Quinidine
Type:
Small organic molecule
Emp. Form.:
C20H24N2O2
Mol. Mass.:
324.4168
SMILES:
COc1ccc2nccc([C@H](O)[C@H]3C[C@@H]4CCN3C[C@@H]4C=C)c2c1
:
Substrate
Name:
BDBM21363
Synonyms:
12-chloro-9-(2-fluorophenyl)-3-methyl-2,4,8-triazatricyclo[8.4.0.0^{2,6}]tetradeca-1(10),3,5,8,11,13-hexaene CHEMBL655 Midazolam US20230416258, Compound Midazolam
Type:
Small organic molecule
Emp. Form.:
C18H13ClFN3
Mol. Mass.:
325.767
SMILES:
Cc1ncc2CN=C(c3ccccc3F)c3cc(Cl)ccc3-n12
: