Target
Vascular endothelial growth factor receptor 2
Ligand
BDBM234598
Substrate
Meas. Tech.
Kinase Assay
pH
7.4±n/a
IC50
93±n/a nM
Comments
extracted
Citation
 Boral, SMalone, TCWang, S Indole-1-carboxamides as kinase inhibitors US Patent  US9353093 Publication Date 5/31/2016 
Target
Name:
Vascular endothelial growth factor receptor 2
Synonyms:
CD_antigen=CD309 Fetal liver kinase 1 (FLK-1) KDR Protein-tyrosine kinase receptor Flk-1 VEGFR-2 VEGFR2 Vascular Endothelial Growth Factor Receptor Kinase 2 Vascular endothelial growth factor receptor 2 (KDR) Vascular endothelial growth factor receptor 2 (VEGFR2) Vascular endothelial growth factor receptor-2 (VEGFR-2)
Type:
Receptor Tyrosine Kinase
Mol. Mass.:
151510.97
Organism:
Homo sapiens (Human)
Description:
P35968
Residue:
1356
  
Inhibitor
Name:
BDBM234598
Synonyms:
US9353093, 27
Type:
Small organic molecule
Emp. Form.:
C21H15F3N4O2S
Mol. Mass.:
444.43
SMILES:
NC(=O)n1c(cc2ccccc12)-c1cc(NC(=O)Nc2cccc(c2)C(F)(F)F)cs1
: