Target
Alpha-1,6-mannosyl-glycoprotein 2-beta-N-acetylglucosaminyltransferase
Ligand
BDBM235186
Substrate
Meas. Tech.
LCMS Assay
pH
7.4±n/a
Temperature
338.15±n/a K
IC50
16±n/a nM
Comments
extracted
Citation
 Ahmad, SNegash, LA Dihydropyridinone MGAT2 inhibitors US Patent  US9365558 Publication Date 6/14/2016 
Target
Name:
Alpha-1,6-mannosyl-glycoprotein 2-beta-N-acetylglucosaminyltransferase
Synonyms:
2.4.1.143 GNT-II MGAT2 Mannoside acetylglucosaminyltransferase 2 Monoacylglycerol acyltransferase type 2 (h-MGAT2) h-MGAT2 (human monoacylglycerol acyltransferase type 2)
Type:
Mol. Mass.:
51567.80
Organism:
Homo sapiens (Human)
Description:
Q10469
Residue:
447
  
Inhibitor
Name:
BDBM235186
Synonyms:
US9365558, 9 | US9822074, 9
Type:
Small organic molecule
Emp. Form.:
C27H28F6N2O5S
Mol. Mass.:
606.577
SMILES:
Cc1ccc(cc1)C1=C(C(=O)NS(C)(=O)=O)C(=O)N[C@@](C1)(c1ccc(OCCCCCC(F)(F)F)cc1)C(F)(F)F
: