Target
Carbonic anhydrase 1 + BH
Ligand
BDBM10880
Substrate
Meas. Tech.
CA Activity Assay
pH
7.5±n/a
Ki
1734±0.0 nM
Comments
0 mM acetaldehyde extracted
Citation
 Bootorabi, FJänis, JHytönen, VPValjakka, JKuuslahti, MVullo, DNiemelä, OSupuran, CTParkkila, S Acetaldehyde-derived modifications on cytosolic human carbonic anhydrases. J Enzyme Inhib Med Chem 26:862-70 (2011)  
Target
Name:
Carbonic anhydrase 1 + BH
Synonyms:
CA I + BH
Type:
Protein
Mol. Mass.:
Description:
Components:
This complex has 2 components.
Component 1
Name:
Carbonic anhydrase 1
Synonyms:
CA-I CAB Carbonate dehydratase I Carbonic anhydrase 1 (CA I) Carbonic anhydrase 1 (Recombinant CA I) Carbonic anhydrase B Carbonic anhydrase I (CA I) Carbonic anhydrase I (CAI) Carbonic anhydrase isoenzyme I (hCA I) | hCA
Type:
Enzyme
Mol. Mass.:
28873.37
Organism:
Homo sapiens (Human)
Description:
P00915
Residue:
261
  
Component 2
Name:
BDBM235669
Synonyms:
Sodium cyanoborohydride
Type:
Small organic molecule
Emp. Form.:
CH3BN
Mol. Mass.:
39.853
SMILES:
[BH3-]C#N
:
Inhibitor
Name:
BDBM10880
Synonyms:
AZA AZM acetazolamide Acetazolamide Acetazolamide (AZA) Acetazolamide, 5 Acetazolamide, AZA CHEMBL20 Sulfonamide, 1 US11278534, Example acetazolamide sulfonamide 1
Type:
Small organic molecule
Emp. Form.:
C4H6N4O3S2
Mol. Mass.:
222.245
SMILES:
CC(=O)Nc1nnc(s1)S(N)(=O)=O
: