Target
Kappa-type opioid receptor
Ligand
BDBM235808
Substrate
Meas. Tech.
Time Resolved Fluorescence Resonance Energy Transfer (TR-FRET)-Based cAMP Immunoassay
Temperature
298.15±n/a K
EC50
0.491±n/a nM
Comments
extracted
Citation
 Schteingart, CDMenzaghi, FJiang, GAlexander, RVSueiras-Diaz, JSpencer, RHChalmers, DTLuo, RZ Synthetic peptide amides US Patent  US9359399 Publication Date 6/7/2016 
Target
Name:
Kappa-type opioid receptor
Synonyms:
KOR-1 OPIATE Kappa Oprk1
Type:
Enzyme
Mol. Mass.:
42656.78
Organism:
Mus musculus (Mouse)
Description:
P33534
Residue:
380
  
Inhibitor
Name:
BDBM235808
Synonyms:
US9359399, 20
Type:
Small organic molecule
Emp. Form.:
C33H49N9O4
Mol. Mass.:
635.8001
SMILES:
CC(C)C[C@@H](NC(=O)[C@@H](Cc1ccccc1)NC(=O)[C@H](N)Cc1ccccc1)C(=O)N[C@H](CNC(N)=N)C(=O)N1CCCNCC1
: