Target
Kappa-type opioid receptor
Ligand
BDBM235809
Substrate
Meas. Tech.
Time Resolved Fluorescence Resonance Energy Transfer (TR-FRET)-Based cAMP Immunoassay
Temperature
298.15±n/a K
EC50
0.095±n/a nM
Comments
extracted
Citation
 Schteingart, CDMenzaghi, FJiang, GAlexander, RVSueiras-Diaz, JSpencer, RHChalmers, DTLuo, RZ Synthetic peptide amides US Patent  US9359399 Publication Date 6/7/2016 
Target
Name:
Kappa-type opioid receptor
Synonyms:
KOR-1 OPIATE Kappa Oprk1
Type:
Enzyme
Mol. Mass.:
42656.78
Organism:
Mus musculus (Mouse)
Description:
P33534
Residue:
380
  
Inhibitor
Name:
BDBM235809
Synonyms:
US9359399, 22
Type:
Small organic molecule
Emp. Form.:
C34H51N9O4
Mol. Mass.:
649.8266
SMILES:
CC(C)C[C@@H](NC(=O)[C@@H](Cc1ccccc1)NC(=O)[C@H](N)Cc1ccccc1)C(=O)N[C@H](CCN)C(=O)N1CCCN(CC1)C(N)=N
: