Target
Cellular tumor antigen p53 [18-26]/E3 ubiquitin-protein ligase Mdm2 [2-188]
Ligand
BDBM236414
Substrate
Meas. Tech.
Time Resolved Fluorescence Energy Transfer (TR-FRET) Assay
Temperature
298.15±n/a K
IC50
0.161±n/a nM
Comments
extracted
Citation
 Cotesta, SFuret, PGuagnano, VHolzer, PKallen, JMah, RMasuya, KSchlapbach, AStutz, SVaupel, A Pyrrolopyrrolidinone compounds US Patent  US9365576 Publication Date 6/14/2016 
Target
Name:
Cellular tumor antigen p53 [18-26]/E3 ubiquitin-protein ligase Mdm2 [2-188]
Synonyms:
p53-MDM2
Type:
Protein
Mol. Mass.:
Description:
Components:
This complex has 2 components.
Component 1
Name:
Cellular tumor antigen p53 [18-26]
Synonyms:
P53 TP53 | Tumor suppressor p53
Type:
Protein
Mol. Mass.:
1122.31
Organism:
Homo sapiens (Human)
Description:
aa 18-26
Residue:
9
TFSDLWKLL
  
Component 2
Name:
E3 ubiquitin-protein ligase Mdm2 [2-188]
Synonyms:
E3 ubiquitin-protein ligase Mdm2 MDM2_HUMAN
Type:
Protein
Mol. Mass.:
21187.98
Organism:
Homo sapiens (Human)
Description:
aa 2-188
Residue:
187
  
Inhibitor
Name:
BDBM236414
Synonyms:
US9365576, 167
Type:
Small organic molecule
Emp. Form.:
C28H26ClN7O3
Mol. Mass.:
544.004
SMILES:
COc1nc(ncc1-c1cc2C(=O)N([C@H](c2n1C(C)C)c1ccc(cc1)C#N)c1cc(Cl)c[nH]c1=O)N(C)C
: