Target
Tyrosine-protein kinase JAK2
Ligand
BDBM236505
Substrate
Meas. Tech.
Kinase Assay
pH
7±n/a
Temperature
298.15±n/a K
IC50
689±n/a nM
Comments
extracted
Citation
 Xi, NLi, MLi, XDai, WWang, T Substituted heteroaryl compounds and methods of use US Patent  US9394281 Publication Date 7/19/2016 
Target
Name:
Tyrosine-protein kinase JAK2
Synonyms:
JAK-2 JAK2_HUMAN Janus kinase 2 (JAK2) | Janus kinase 2 (a protein tyrosine kinase)
Type:
Protein
Mol. Mass.:
130684.68
Organism:
Homo sapiens (Human)
Description:
O60674
Residue:
1132
  
Inhibitor
Name:
BDBM236505
Synonyms:
US9394281, 1
Type:
Small organic molecule
Emp. Form.:
C15H19ClN6O3
Mol. Mass.:
366.803
SMILES:
CN(C1COC2C(O)COC12)c1nc(Nc2cnn(C)c2)ncc1Cl
: