Target
Tyrosine-protein kinase JAK2
Ligand
BDBM236508
Substrate
Meas. Tech.
Kinase Assay
pH
7±n/a
Temperature
298.15±n/a K
IC50
99±n/a nM
Comments
extracted
Citation
 Xi, NLi, MLi, XDai, WWang, T Substituted heteroaryl compounds and methods of use US Patent  US9394281 Publication Date 7/19/2016 
Target
Name:
Tyrosine-protein kinase JAK2
Synonyms:
JAK-2 JAK2_HUMAN Janus kinase 2 (JAK2) | Janus kinase 2 (a protein tyrosine kinase)
Type:
Protein
Mol. Mass.:
130684.68
Organism:
Homo sapiens (Human)
Description:
O60674
Residue:
1132
  
Inhibitor
Name:
BDBM236508
Synonyms:
US9394281, 7
Type:
Small organic molecule
Emp. Form.:
C14H18ClN7O2
Mol. Mass.:
351.791
SMILES:
Cn1cc(Nc2ncc(Cl)c(NC3COC4C(N)COC34)n2)cn1
: