Target
Aurora kinase B
Ligand
BDBM236509
Substrate
Meas. Tech.
Kinase Assay
pH
7±n/a
Temperature
298.15±n/a K
IC50
31±n/a nM
Comments
extracted
Citation
 Xi, NLi, MLi, XDai, WWang, T Substituted heteroaryl compounds and methods of use US Patent  US9394281 Publication Date 7/19/2016 
Target
Name:
Aurora kinase B
Synonyms:
AIK2 AIM1 ARK2 AURKB_HUMAN Aurora B-INCENP Aurora kinase B (AURKB) STK-1 STK12 Serine/threonine-protein kinase aurora B
Type:
Protein
Mol. Mass.:
39327.72
Organism:
Homo sapiens (Human)
Description:
Q96GD4
Residue:
344
  
Inhibitor
Name:
BDBM236509
Synonyms:
US9394281, 8
Type:
Small organic molecule
Emp. Form.:
C15H20ClN7O4S
Mol. Mass.:
429.882
SMILES:
Cn1cc(Nc2ncc(Cl)c(NC3COC4C(COC34)NS(C)(=O)=O)n2)cn1
: