Target
Receptor-type tyrosine-protein kinase FLT3
Ligand
BDBM236509
Substrate
Meas. Tech.
Kinase Assay
pH
7±n/a
Temperature
298.15±n/a K
IC50
11±n/a nM
Comments
extracted
Citation
 Xi, NLi, MLi, XDai, WWang, T Substituted heteroaryl compounds and methods of use US Patent  US9394281 Publication Date 7/19/2016 
Target
Name:
Receptor-type tyrosine-protein kinase FLT3
Synonyms:
CD135 FL cytokine receptor FLK2 FLT3 Fetal liver kinase-2 Fms-like tyrosine kinase 3 (Flt-3) STK-1 Stem cell tyrosine kinase 1
Type:
Enzyme
Mol. Mass.:
112888.62
Organism:
Homo sapiens (Human)
Description:
P36888
Residue:
993
  
Inhibitor
Name:
BDBM236509
Synonyms:
US9394281, 8
Type:
Small organic molecule
Emp. Form.:
C15H20ClN7O4S
Mol. Mass.:
429.882
SMILES:
Cn1cc(Nc2ncc(Cl)c(NC3COC4C(COC34)NS(C)(=O)=O)n2)cn1
: