Target
C-X-C chemokine receptor type 1
Ligand
BDBM236813
Substrate
Meas. Tech.
In Vitro Affinity Assay
Temperature
310.15±n/a K
IC50
20±n/a nM
Comments
extracted
Citation
 Musicki, BAubert, JBoiteaux, JClary, LRossio, PSchuppli-Nollet, M Disubstituted 3,4-diamino-3-cyclobutene-1,2-dione compounds for use in the treatment of chemokine-mediated diseases US Patent  US9388149 Publication Date 7/12/2016 
Target
Name:
C-X-C chemokine receptor type 1
Synonyms:
C-X-C chemokine receptor type 1 (CXCR-1) CMKAR1 CXCR1_HUMAN Interleukin-8 receptor A | Interleukin-8 receptors, CXCR1/CXCR2
Type:
Enzyme
Mol. Mass.:
39803.83
Organism:
Homo sapiens (Human)
Description:
P25024
Residue:
350
  
Inhibitor
Name:
BDBM236813
Synonyms:
US9388149, 10 (Diastereoisomer 1) | US9388149, 10 (Diastereoisomer 2)
Type:
Small organic molecule
Emp. Form.:
C22H24ClN3O6S2
Mol. Mass.:
526.025
SMILES:
CN(C)S(=O)(=O)c1c(Cl)ccc(Nc2c(NC(C3CCCS3)c3ccc(C)o3)c(=O)c2=O)c1O
: