Target
C-X-C chemokine receptor type 2
Ligand
BDBM236782
Substrate
Meas. Tech.
In Vitro Affinity Assay
Temperature
310.15±n/a K
IC50
170±n/a nM
Comments
extracted
Citation
 Musicki, BAubert, JBoiteaux, JClary, LRossio, PSchuppli-Nollet, M Disubstituted 3,4-diamino-3-cyclobutene-1,2-dione compounds for use in the treatment of chemokine-mediated diseases US Patent  US9388149 Publication Date 7/12/2016 
Target
Name:
C-X-C chemokine receptor type 2
Synonyms:
C-X-C chemokine receptor type 2 (CXCR-2) CD_antigen=CD182 CXCR-2 CXCR2_HUMAN GRO/MGSA receptor IL-8 receptor type 2 IL8RB | Interleukin-8 receptor B
Type:
Protein
Mol. Mass.:
40767.88
Organism:
Homo sapiens (Human)
Description:
P25025
Residue:
360
  
Inhibitor
Name:
BDBM236782
Synonyms:
US9388149, 13 | US9580412, Example 13
Type:
Small organic molecule
Emp. Form.:
C24H25N3O5
Mol. Mass.:
435.4724
SMILES:
CN(C)C(=O)c1cccc(Nc2c(NC(C3CCCO3)c3ccccc3)c(=O)c2=O)c1O
: