Target
Phosphatidylinositol 4,5-bisphosphate 3-kinase catalytic subunit delta isoform
Ligand
BDBM236945
Substrate
Meas. Tech.
HTRF Assay
IC50
0.4±n/a nM
Citation
 Erra Sola, MCarrascal Riera, MTaltavull Moll, JCaturla Javaloyes, JFBernal Anchuela, FJPages Santacana, LMMir Cepeda, MCasals Coll, GHernandez Olasagarre, MB Pyrrolotriazinone derivatives as PI3K inhibitors US Patent  US9388189 Publication Date 7/12/2016 
Target
Name:
Phosphatidylinositol 4,5-bisphosphate 3-kinase catalytic subunit delta isoform
Synonyms:
PI3-kinase p110 subunit delta PI3-kinase subunit p110-delta PIK3CD Phosphatidylinositol 4,5-biphosphate 3-kinase catalytic subunit delta (PIK3CD) Phosphatidylinositol 4,5-bisphosphate 3-kinase 110 kDa catalytic subunit delta (PI3K delta) Phosphatidylinositol 4,5-bisphosphate 3-kinase catalytic subunit delta (PI3Kdelta) Phosphatidylinositol 4,5-bisphosphate 3-kinase catalytic subunit delta isoform (PI3K delta) Phosphatidylinositol 4,5-bisphosphate 3-kinase catalytic subunit delta isoform (PI3K-delta) Phosphatidylinositol 4,5-bisphosphate 3-kinase catalytic subunit delta isoform (PI3Kdelta)
Type:
Enzyme Subunit
Mol. Mass.:
119489.41
Organism:
Homo sapiens (Human)
Description:
O00329
Residue:
1044
  
Inhibitor
Name:
BDBM236945
Synonyms:
US9388189, 78
Type:
Small organic molecule
Emp. Form.:
C28H24FN7O2
Mol. Mass.:
509.5343
SMILES:
C[C@H](Nc1ncnc2[nH]cc(Cc3cc(O)cc(F)c3)c12)c1nn2ccc(C)c2c(=O)n1-c1ccccc1
: