Target
Retinoic acid receptor RXR-alpha [225-462]/Thyroid hormone receptor beta [148-410]
Ligand
BDBM50012859
Substrate
Meas. Tech.
Recruitment Assay
pH
7±n/a
EC50
7310±n/a nM
Comments
extracted
Citation
 Haynes, NKertesz, DJPietranico-Cole, SLQian, YScott, NRSo, SThakkar, KCTilley, JW Thyroid hormone analogs US Patent  USRE46024 Publication Date 6/7/2016 
Target
Name:
Retinoic acid receptor RXR-alpha [225-462]/Thyroid hormone receptor beta [148-410]
Synonyms:
Thyroid Hormone Receptor Beta/ Retinoid X Receptor
Type:
Protein
Mol. Mass.:
Description:
Components:
This complex has 2 components.
Component 1
Name:
Thyroid hormone receptor beta [148-410]
Synonyms:
ERBA2 THB_HUMAN THRB | Thyroid hormone receptor beta
Type:
Protein
Mol. Mass.:
29766.52
Organism:
Homo sapiens (Human)
Description:
amino acids 148-410
Residue:
263
  
Component 2
Name:
Retinoic acid receptor RXR-alpha [225-462]
Synonyms:
NR2B1 RXRA_HUMAN | Retinoic acid receptor RXR-alpha
Type:
Protein
Mol. Mass.:
26631.53
Organism:
Homo sapiens (Human)
Description:
amino acids 225-462
Residue:
238
  
Inhibitor
Name:
BDBM50012859
Synonyms:
CHEMBL3261319 | USRE46024, 2
Type:
Small organic molecule
Emp. Form.:
C16H17ClN2O4
Mol. Mass.:
336.77
SMILES:
CC(C)c1cc(Oc2c(C)cc(CC(O)=O)cc2Cl)n[nH]c1=O
: