Target
Carbonic anhydrase 3
Ligand
BDBM60967
Substrate
Meas. Tech.
CA Activity Assay
pH
7.4±n/a
Ki
590±n/a nM
Comments
extracted
Citation
 Ekinci, DKurbanoglu, NISalamci, ESentürk, MSupuran, CT Carbonic anhydrase inhibitors: inhibition of human and bovine isoenzymes by benzenesulphonamides, cyclitols and phenolic compounds. J Enzyme Inhib Med Chem 27:845-8 (2012)  
Target
Name:
Carbonic anhydrase 3
Synonyms:
CA-III CAH3_BOVIN Carbonic anhydrase 3 Carbonic anhydrase III
Type:
Enzyme
Mol. Mass.:
29376.92
Organism:
Bos taurus (Cattle)
Description:
Q3SZX4
Residue:
260
  
Inhibitor
Name:
BDBM60967
Synonyms:
Carbonic anhydrase inhibitors (CAIs), 5
Type:
Emp. Form.:
C13H19NO5S
Mol. Mass.:
301.359
SMILES:
Cc1ccc(cc1)S(=O)(=O)N[C@H]1[C@@H](O)CC[C@H](O)[C@@H]1O
: