Target
Carbonic anhydrase 9
Ligand
BDBM25900
Substrate
Meas. Tech.
CA Inhibition Assay
pH
7.5±n/a
Temperature
298.15±n/a K
Ki
2.3e+4±n/a nM
Comments
extracted
Citation
 Liu, FMartin-Mingot, ALecornué, FJouannetaud, MPMaresca, AThibaudeau, SSupuran, CT Carbonic anhydrases inhibitory effects of new benzenesulfonamides synthesized by using superacid chemistry. J Enzyme Inhib Med Chem 27:886-91 (2012)  
Target
Name:
Carbonic anhydrase 9
Synonyms:
CA-IX CAH9_HUMAN Carbonic anhydrase 9 (CA IX) Carbonic anhydrase 9 precursor Carbonic anhydrase IX (CAIX) Carbonic anhydrases; II & IX MN RCC-associated antigen G250
Type:
Enzyme
Mol. Mass.:
49669.03
Organism:
Homo sapiens (Human)
Description:
Catalytic domain of human cloned isozyme was used in the assay
Residue:
459
  
Inhibitor
Name:
BDBM25900
Synonyms:
2-chloro-5-(1-hydroxy-3-oxo-2,3-dihydro-1H-isoindol-1-yl)benzene-1-sulfonamide Chlorthalidone Hygroton US10172837, Chlorthalidone
Type:
Small organic molecule
Emp. Form.:
C14H11ClN2O4S
Mol. Mass.:
338.766
SMILES:
NS(=O)(=O)c1cc(ccc1Cl)C1(O)NC(=O)c2ccccc12
: