Target
Carbonic anhydrase 1
Ligand
BDBM50044857
Substrate
Meas. Tech.
Esterase Activity Assay
IC50
249120±n/a nM
Citation
 Alp, CÖzsoy, Å¿Alp, NAErdem, DGültekin, MSKüfrevioglu, ÿİSentürk, MSupuran, CT Sulfapyridine-like benzenesulfonamide derivatives as inhibitors of carbonic anhydrase isoenzymes I, II and VI. J Enzyme Inhib Med Chem 27:818-24 (2012)  
Target
Name:
Carbonic anhydrase 1
Synonyms:
CA-I CAB Carbonate dehydratase I Carbonic anhydrase 1 (CA I) Carbonic anhydrase 1 (Recombinant CA I) Carbonic anhydrase B Carbonic anhydrase I (CA I) Carbonic anhydrase I (CAI) Carbonic anhydrase isoenzyme I (hCA I) | hCA
Type:
Enzyme
Mol. Mass.:
28873.37
Organism:
Homo sapiens (Human)
Description:
P00915
Residue:
261
  
Inhibitor
Name:
BDBM50044857
Synonyms:
CA inhibitor, 4 | CHEMBL3311314
Type:
Small organic molecule
Emp. Form.:
C16H19NO2S
Mol. Mass.:
289.393
SMILES:
Cc1ccc(cc1)S(=O)(=O)Nc1c(C)cc(C)cc1C
: