Target
Carbonic anhydrase 1
Ligand
BDBM237303
Substrate
Meas. Tech.
Esterase Activity Assay
IC50
448200±n/a nM
Citation
 Alp, CÖzsoy, Å¿Alp, NAErdem, DGültekin, MSKüfrevioglu, ÿİSentürk, MSupuran, CT Sulfapyridine-like benzenesulfonamide derivatives as inhibitors of carbonic anhydrase isoenzymes I, II and VI. J Enzyme Inhib Med Chem 27:818-24 (2012)  
Target
Name:
Carbonic anhydrase 1
Synonyms:
CA-I CAB Carbonate dehydratase I Carbonic anhydrase 1 (CA I) Carbonic anhydrase 1 (Recombinant CA I) Carbonic anhydrase B Carbonic anhydrase I (CA I) Carbonic anhydrase I (CAI) Carbonic anhydrase isoenzyme I (hCA I) | hCA
Type:
Enzyme
Mol. Mass.:
28873.37
Organism:
Homo sapiens (Human)
Description:
P00915
Residue:
261
  
Inhibitor
Name:
BDBM237303
Synonyms:
N-(4-ethylphenyl)-4-methylbenzenesulfonamide (9)
Type:
Small organic molecule
Emp. Form.:
C15H17NO2S
Mol. Mass.:
275.366
SMILES:
CCc1ccc(NS(=O)(=O)c2ccc(C)cc2)cc1
: