Target
Carbonic anhydrase 2
Ligand
BDBM237301
Substrate
Meas. Tech.
Esterase Activity Assay
IC50
213±n/a nM
Citation
 Alp, CÖzsoy, Å¿Alp, NAErdem, DGültekin, MSKüfrevioglu, ÿİSentürk, MSupuran, CT Sulfapyridine-like benzenesulfonamide derivatives as inhibitors of carbonic anhydrase isoenzymes I, II and VI. J Enzyme Inhib Med Chem 27:818-24 (2012)  
Target
Name:
Carbonic anhydrase 2
Synonyms:
CA-II CAC Carbonate dehydratase II Carbonic anhydrase 2 (CA-II) Carbonic anhydrase C Carbonic anhydrase II (CA-II) Carbonic anhydrase II (hCA II) | Carbonic anhydrase isoenzyme II (hCA II)
Type:
Enzyme
Mol. Mass.:
29250.71
Organism:
Homo sapiens (Human)
Description:
P00918
Residue:
260
  
Inhibitor
Name:
BDBM237301
Synonyms:
N-(2-cyanophenyl)-4-methylbenzenesulfonamide (6)
Type:
Small organic molecule
Emp. Form.:
C14H12N2O2S
Mol. Mass.:
272.322
SMILES:
Cc1ccc(cc1)S(=O)(=O)Nc1ccccc1C#N
: