Target
Carbonic anhydrase 6
Ligand
BDBM237302
Substrate
Meas. Tech.
Esterase Activity Assay
IC50
4710±n/a nM
Citation
 Alp, CÖzsoy, Å¿Alp, NAErdem, DGültekin, MSKüfrevioglu, ÿİSentürk, MSupuran, CT Sulfapyridine-like benzenesulfonamide derivatives as inhibitors of carbonic anhydrase isoenzymes I, II and VI. J Enzyme Inhib Med Chem 27:818-24 (2012)  
Target
Name:
Carbonic anhydrase 6
Synonyms:
CA-VI CAH6_HUMAN Carbonic Anhydrase VI Carbonic anhydrase 6 Carbonic anhydrase 6 (CA-VI) Salivary carbonic anhydrase | Secreted carbonic anhydrase
Type:
Enzyme
Mol. Mass.:
35371.40
Organism:
Homo sapiens (Human)
Description:
P23280
Residue:
308
  
Inhibitor
Name:
BDBM237302
Synonyms:
4-Methyl-N-(2-nitrophenyl) benzenesulfonamide (7)
Type:
Small organic molecule
Emp. Form.:
C13H12N2O4S
Mol. Mass.:
292.31
SMILES:
Cc1ccc(cc1)S(=O)(=O)Nc1ccccc1[N+]([O-])=O
: