Target
Platelet-derived growth factor receptor alpha
Ligand
BDBM238345
Substrate
Meas. Tech.
Inhibition Assay
IC50
393±n/a nM
Citation
 Bae, IHHan, SMKwak, EJAhn, YGSuh, KH Isoquinoline-5-carboxamide derivative having inhibitory activity for protein kinase US Patent  US9388165 Publication Date 7/12/2016 
Target
Name:
Platelet-derived growth factor receptor alpha
Synonyms:
Alpha-type platelet-derived growth factor receptor PDGFRA PGFRA_HUMAN Platelet-derived growth factor receptor alpha (PDGFRA) RHEPDGFRA
Type:
Protein
Mol. Mass.:
122633.38
Organism:
Homo sapiens (Human)
Description:
P16234
Residue:
1089
  
Inhibitor
Name:
BDBM238345
Synonyms:
US9388165, 1
Type:
Small organic molecule
Emp. Form.:
C25H19F3N4O2
Mol. Mass.:
464.4392
SMILES:
Cc1ccc(NC(=O)c2cccc(c2)C(F)(F)F)cc1NC(=O)c1cccc2c(N)nccc12
: