Target
Fibroblast growth factor receptor 1
Ligand
BDBM238345
Substrate
Meas. Tech.
Inhibition Assay
IC50
>2500±n/a nM
Citation
 Bae, IHHan, SMKwak, EJAhn, YGSuh, KH Isoquinoline-5-carboxamide derivative having inhibitory activity for protein kinase US Patent  US9388165 Publication Date 7/12/2016 
Target
Name:
Fibroblast growth factor receptor 1
Synonyms:
BFGFR Basic fibroblast growth factor receptor 1 (FGFR1) CEK FGFR-1 FGFR-1, (FL) FGFR1_HUMAN FLT2 Fibroblast growth factor receptor 1 (FGFR-1) Fms-like tyrosine kinase 2 N-sam bFGF-R | c-fgr
Type:
Receptor
Mol. Mass.:
91861.70
Organism:
Homo sapiens (Human)
Description:
P11362
Residue:
822
  
Inhibitor
Name:
BDBM238345
Synonyms:
US9388165, 1
Type:
Small organic molecule
Emp. Form.:
C25H19F3N4O2
Mol. Mass.:
464.4392
SMILES:
Cc1ccc(NC(=O)c2cccc(c2)C(F)(F)F)cc1NC(=O)c1cccc2c(N)nccc12
: