Target
Receptor-type tyrosine-protein kinase FLT3
Ligand
BDBM238345
Substrate
Meas. Tech.
Inhibition Assay
IC50
>2500±n/a nM
Citation
 Bae, IHHan, SMKwak, EJAhn, YGSuh, KH Isoquinoline-5-carboxamide derivative having inhibitory activity for protein kinase US Patent  US9388165 Publication Date 7/12/2016 
Target
Name:
Receptor-type tyrosine-protein kinase FLT3
Synonyms:
CD135 FL cytokine receptor FLK2 FLT3 Fetal liver kinase-2 Fms-like tyrosine kinase 3 (Flt-3) STK-1 Stem cell tyrosine kinase 1
Type:
Enzyme
Mol. Mass.:
112888.62
Organism:
Homo sapiens (Human)
Description:
P36888
Residue:
993
  
Inhibitor
Name:
BDBM238345
Synonyms:
US9388165, 1
Type:
Small organic molecule
Emp. Form.:
C25H19F3N4O2
Mol. Mass.:
464.4392
SMILES:
Cc1ccc(NC(=O)c2cccc(c2)C(F)(F)F)cc1NC(=O)c1cccc2c(N)nccc12
: