Target
Glycogen synthase kinase-3 beta
Ligand
BDBM293439
Substrate
Meas. Tech.
GSK3 beta kinase assay
Temperature
298.15±n/a K
EC50
>10000±n/a nM
Comments
extracted
Citation
 KC, SKMak, CCEastman, BWCao, JBollu, VMittapalli, GKChiruta, C Isoquinolin-3-yl carboxamides and preparation and use thereof US Patent  US10106527 Publication Date 10/23/2018 
Target
Name:
Glycogen synthase kinase-3 beta
Synonyms:
GSK-3 beta GSK3B Glycogen synthase kinase 3 beta (GSK3B) Glycogen synthase kinase-3 beta (GSK-3B) Glycogen synthase kinase-3 beta (GSK3B) Glycogen synthase kinase-3beta (GSK3B) | Serine/threonine-protein kinase GSK3B
Type:
Enzyme
Mol. Mass.:
46756.38
Organism:
Homo sapiens (Human)
Description:
P49841
Residue:
420
  
Inhibitor
Name:
BDBM293439
Synonyms:
US10106527, Compound 25 US11548872, Compound 25 US9951048, Compound 25
Type:
Small organic molecule
Emp. Form.:
C26H25F2N5O2
Mol. Mass.:
477.5058
SMILES:
CN1CCC(CC1)n1cc(cn1)-c1ccc2cnc(NC(=O)c3ccc(OC(F)F)cc3)cc2c1
: