Target
Muscarinic acetylcholine receptor M3
Ligand
BDBM6387
Substrate
Meas. Tech.
Radioligand Binding Assay
Temperature
310.15±n/a K
Ki
0.1±n/a nM
Comments
extracted
Citation
 Hughes, ADByun, DJacobsen, JR Diamide compounds having muscarinic receptor antagonist and BETA2 adrenergic receptor agonist activity US Patent  US9394275 Publication Date 7/19/2016 
Target
Name:
Muscarinic acetylcholine receptor M3
Synonyms:
ACM3_HUMAN Cholinergic, muscarinic M3 Muscarinic receptor M3 | RecName: Full=Muscarinic acetylcholine receptor M3
Type:
Enzyme
Mol. Mass.:
66151.03
Organism:
Homo sapiens (Human)
Description:
P20309
Residue:
590
  
Inhibitor
Name:
BDBM6387
Synonyms:
US8816088, 18 US9572802, Compound I-18 | US9682957, I-18
Type:
Emp. Form.:
C47H56N6O7
Mol. Mass.:
816.9835
SMILES:
CN(CCCCC(=O)Nc1cc(C)c(CNC[C@H](O)c2ccc(O)c3[nH]c(=O)ccc23)cc1C)C(=O)CCN1CCC(CC1)OC(=O)Nc1ccccc1-c1ccccc1
: