Target
Serine/threonine-protein kinase pim-1
Ligand
BDBM238487
Substrate
Meas. Tech.
Homogeneous Time Resolved Fluorescence Assay (HTRF)
pH
7±n/a
Temperature
295.15±n/a K
IC50
3.2±n/a nM
Comments
extracted
Citation
 Cee, VChavez, Jr., FChen, JJHarrington, EHHerberich, BJackson, CLLanman, BANguyen, TTNorman, MHPettus, LHReed, ABSmith, ALTamayo, NATasker, AWang, HWu, BWurz, R Amides as pim inhibitors US Patent  US9394297 Publication Date 7/19/2016 
Target
Name:
Serine/threonine-protein kinase pim-1
Synonyms:
PIM-1 Kinase PIM1_HUMAN Serine/threonine-protein kinase (PIM1) Serine/threonine-protein kinase PIM1 | Serine/threonine-protein kinase pim-1 (PIM1)
Type:
Protein
Mol. Mass.:
35681.82
Organism:
Homo sapiens (Human)
Description:
P11309
Residue:
313
  
Inhibitor
Name:
BDBM238487
Synonyms:
US9394297, 117 US9394297, 250
Type:
Small organic molecule
Emp. Form.:
C25H24N4O
Mol. Mass.:
396.4843
SMILES:
CCC1CNC(=O)c2cc([nH]c12)-c1cccc2cc(C)c(Nc3ccccc3)nc12
: