Target
Serine/threonine-protein kinase pim-1
Ligand
BDBM238494
Substrate
Meas. Tech.
Homogeneous Time Resolved Fluorescence Assay (HTRF)
pH
7±n/a
Temperature
295.15±n/a K
IC50
6.4±n/a nM
Comments
extracted
Citation
 Cee, VChavez, Jr., FChen, JJHarrington, EHHerberich, BJackson, CLLanman, BANguyen, TTNorman, MHPettus, LHReed, ABSmith, ALTamayo, NATasker, AWang, HWu, BWurz, R Amides as pim inhibitors US Patent  US9394297 Publication Date 7/19/2016 
Target
Name:
Serine/threonine-protein kinase pim-1
Synonyms:
PIM-1 Kinase PIM1_HUMAN Serine/threonine-protein kinase (PIM1) Serine/threonine-protein kinase PIM1 | Serine/threonine-protein kinase pim-1 (PIM1)
Type:
Protein
Mol. Mass.:
35681.82
Organism:
Homo sapiens (Human)
Description:
P11309
Residue:
313
  
Inhibitor
Name:
BDBM238494
Synonyms:
US9394297, 124
Type:
Small organic molecule
Emp. Form.:
C21H23N5O
Mol. Mass.:
361.4402
SMILES:
O=C1NCCc2[nH]c(cc12)-c1cccc2ccc(N[C@@H]3CCCNC3)nc12
: