Target
Serine/threonine-protein kinase pim-1
Ligand
BDBM238510
Substrate
Meas. Tech.
Homogeneous Time Resolved Fluorescence Assay (HTRF)
pH
7±n/a
Temperature
295.15±n/a K
IC50
3.7±n/a nM
Comments
extracted
Citation
 Cee, VChavez, Jr., FChen, JJHarrington, EHHerberich, BJackson, CLLanman, BANguyen, TTNorman, MHPettus, LHReed, ABSmith, ALTamayo, NATasker, AWang, HWu, BWurz, R Amides as pim inhibitors US Patent  US9394297 Publication Date 7/19/2016 
Target
Name:
Serine/threonine-protein kinase pim-1
Synonyms:
PIM-1 Kinase PIM1_HUMAN Serine/threonine-protein kinase (PIM1) Serine/threonine-protein kinase PIM1 | Serine/threonine-protein kinase pim-1 (PIM1)
Type:
Protein
Mol. Mass.:
35681.82
Organism:
Homo sapiens (Human)
Description:
P11309
Residue:
313
  
Inhibitor
Name:
BDBM238510
Synonyms:
US9394297, 140 | US9394297, 141
Type:
Small organic molecule
Emp. Form.:
C22H26N6O
Mol. Mass.:
390.4814
SMILES:
Cc1nc2cccc(-c3cc4c(CCNC4=O)[nH]3)c2nc1N[C@@H]1CCC[C@H](N)C1
: