Target
Cellular tumor antigen p53 [18-26]/E3 ubiquitin-protein ligase Mdm2 [2-188]
Ligand
BDBM238907
Substrate
Meas. Tech.
Time Resolved Fluorescence Energy Transfer (TR-FRET) Assay
Temperature
298.15±n/a K
IC50
210±n/a nM
Comments
extracted
Citation
 Furet, PGuagnano, VHolzer, PKallen, JMah, RMasuya, KSchlapbach, AVaupel, A Substituted purinone compounds US Patent  US9403827 Publication Date 8/2/2016 
Target
Name:
Cellular tumor antigen p53 [18-26]/E3 ubiquitin-protein ligase Mdm2 [2-188]
Synonyms:
p53-MDM2
Type:
Protein
Mol. Mass.:
Description:
Components:
This complex has 2 components.
Component 1
Name:
Cellular tumor antigen p53 [18-26]
Synonyms:
P53 TP53 | Tumor suppressor p53
Type:
Protein
Mol. Mass.:
1122.31
Organism:
Homo sapiens (Human)
Description:
aa 18-26
Residue:
9
TFSDLWKLL
  
Component 2
Name:
E3 ubiquitin-protein ligase Mdm2 [2-188]
Synonyms:
E3 ubiquitin-protein ligase Mdm2 MDM2_HUMAN
Type:
Protein
Mol. Mass.:
21187.98
Organism:
Homo sapiens (Human)
Description:
aa 2-188
Residue:
187
  
Inhibitor
Name:
BDBM238907
Synonyms:
US9403827, 9
Type:
Small organic molecule
Emp. Form.:
C31H31Cl2N5O3
Mol. Mass.:
592.516
SMILES:
CNC(=O)c1ccc(OC)c(c1)-c1nc2NC(=O)N(C(c2n1C(C)C)c1ccc(Cl)cc1C)c1cc(Cl)ccc1C
: