Target
Cellular tumor antigen p53 [18-26]/E3 ubiquitin-protein ligase Mdm2 [2-188]
Ligand
BDBM238922
Substrate
Meas. Tech.
Time Resolved Fluorescence Energy Transfer (TR-FRET) Assay
Temperature
298.15±n/a K
IC50
748±n/a nM
Comments
extracted
Citation
 Furet, PGuagnano, VHolzer, PKallen, JMah, RMasuya, KSchlapbach, AVaupel, A Substituted purinone compounds US Patent  US9403827 Publication Date 8/2/2016 
Target
Name:
Cellular tumor antigen p53 [18-26]/E3 ubiquitin-protein ligase Mdm2 [2-188]
Synonyms:
p53-MDM2
Type:
Protein
Mol. Mass.:
Description:
Components:
This complex has 2 components.
Component 1
Name:
Cellular tumor antigen p53 [18-26]
Synonyms:
P53 TP53 | Tumor suppressor p53
Type:
Protein
Mol. Mass.:
1122.31
Organism:
Homo sapiens (Human)
Description:
aa 18-26
Residue:
9
TFSDLWKLL
  
Component 2
Name:
E3 ubiquitin-protein ligase Mdm2 [2-188]
Synonyms:
E3 ubiquitin-protein ligase Mdm2 MDM2_HUMAN
Type:
Protein
Mol. Mass.:
21187.98
Organism:
Homo sapiens (Human)
Description:
aa 2-188
Residue:
187
  
Inhibitor
Name:
BDBM238922
Synonyms:
US9403827, 24
Type:
Small organic molecule
Emp. Form.:
C27H27Cl2FN8O3
Mol. Mass.:
601.459
SMILES:
COc1nc(ncc1-c1nc2NC(=O)N(C(c2n1C(C)C)c1ccc(Cl)c(F)c1)c1cc(Cl)cn(C)c1=O)N(C)C
: