Target
Angiopoietin-1 receptor [776-1124]
Ligand
BDBM239717
Substrate
Meas. Tech.
Time-Resolved Fluorescence Resonance Energy Transfer (TR-FRET) Assay
pH
7±n/a
Temperature
295.15±n/a K
IC50
0.8±n/a nM
Comments
extracted
Citation
 Süβmeier, FLobell, MGrünewald, SHärter, MBuchmann, BTelser, JJöriβen, HHeroult, MKahnert, ALustig, KLindner, N Substituted phenylimidazopyrazoles and their use US Patent  US9394309 Publication Date 7/19/2016 
Target
Name:
Angiopoietin-1 receptor [776-1124]
Synonyms:
TEK TIE2_HUMAN VMCM | VMCM1
Type:
Enzyme
Mol. Mass.:
39865.58
Organism:
Homo sapiens (Human)
Description:
amino acids 776-1124
Residue:
349
  
Inhibitor
Name:
BDBM239717
Synonyms:
US9394309, 176
Type:
Small organic molecule
Emp. Form.:
C23H18F5N5O3S3
Mol. Mass.:
603.608
SMILES:
Cc1ccc(NC(=O)c2cc(cc(c2)S(F)(F)(F)(F)F)S(C)(=O)=O)cc1-n1ccn2nc(cc12)-c1cncs1
: