Target
Protein O-GlcNAcase
Ligand
BDBM240650
Substrate
BDBM240663
Meas. Tech.
Fluorescence-Based Assay
pH
7±n/a
Temperature
298.15±n/a K
Ki
3.5±n/a nM
Comments
extracted
Citation
 Li, TMcEachern, EVocadlo, DZhou, YZhu, YSelnick, H Selective glycosidase inhibitors and uses thereof US Patent  US9409924 Publication Date 8/9/2016 
Target
Name:
Protein O-GlcNAcase
Synonyms:
2-acetamido-2-deoxy-β-D-glucopyranosidase (O-GlcNAcase) Beta-hexosaminidase (O-GlcNAcase) HEXC MEA5 N-acetyl-beta-D-glucosaminidase (O-GlcNAcase) OGA Protein O-GlcNAcase
Type:
Enzyme
Mol. Mass.:
102874.67
Organism:
Homo sapiens (Human)
Description:
O60502
Residue:
916
  
Inhibitor
Name:
BDBM240650
Synonyms:
US9409924, 9
Type:
Small organic molecule
Emp. Form.:
C9H12F4N2O3S
Mol. Mass.:
304.262
SMILES:
CNC1=N[C@H]2[C@H](O[C@H]([C@@H](O)C(F)(F)F)[C@@H](O)[C@@H]2F)S1
:
Substrate
Name:
BDBM240663
Synonyms:
US9409924, 4-Methylumbelliferyl N-acetyl-B-D-glucosaminide
Type:
Small organic molecule
Emp. Form.:
C18H21NO8
Mol. Mass.:
379.3612
SMILES:
CC(=O)N[C@@H]1[C@@H](O)[C@H](O)[C@@H](CO)O[C@H]1Oc1ccc2c(C)cc(=O)oc2c1
: