Target
Trace amine-associated receptor 1
Ligand
BDBM240667
Substrate
Meas. Tech.
Radioligand Binding (mouse TAAR1)
pH
7.4±n/a
Temperature
310.15±n/a K
Ki
0.4±n/a nM
Comments
extracted
Citation
 Galley, GGhellamallah, CNorcross, RPflieger, P Triazole carboxamides and uses thereof US Patent  US9416127 Publication Date 8/16/2016 
Target
Name:
Trace amine-associated receptor 1
Synonyms:
TAAR1_MOUSE Taar1 Trace amine receptor 1 (TARR1) Trace amine-associated receptor1 | Trar1
Type:
Protein
Mol. Mass.:
37635.41
Organism:
Mus musculus (Mouse)
Description:
Q923Y8
Residue:
332
  
Inhibitor
Name:
BDBM240667
Synonyms:
US9416127, 4 | US9416127, 9
Type:
Small organic molecule
Emp. Form.:
C19H18FN5O2
Mol. Mass.:
367.3769
SMILES:
Fc1ccc(cc1)-n1ncc(n1)C(=O)Nc1ccc(cc1)[C@H]1CNCCO1
: