Target
Genome polyprotein [2420-3010]
Ligand
BDBM240854
Substrate
Meas. Tech.
HCV Replicon Assay
pH
7.5±n/a
Temperature
300.15±n/a K
EC50
16710±n/a nM
Comments
extracted
Citation
 Du, JSofia, MJ 2′-spiro-nucleosides and derivatives thereof useful for treating hepatitis C virus and dengue virus infections US Patent  US9394331 Publication Date 7/19/2016 
Target
Name:
Genome polyprotein [2420-3010]
Synonyms:
POLG_HCVCO RNA-directed RNA polymerase (NS5B)
Type:
Enzyme
Mol. Mass.:
65783.36
Organism:
Hepatitis C virus genotype 1b (isolate Con1) (HCV)
Description:
aa 2420-3010
Residue:
591
  
Inhibitor
Name:
BDBM240854
Synonyms:
US9394331, 117
Type:
Small organic molecule
Emp. Form.:
C21H26N3O10P
Mol. Mass.:
511.419
SMILES:
COC(=O)[C@H](C)NP(=O)(OCC1OC(n2ccc(=O)[nH]c2=O)[C@@]2(CCO2)[C@@H]1O)Oc1ccccc1
: