Target
Vascular endothelial growth factor receptor 2
Ligand
BDBM241822
Substrate
Meas. Tech.
Kinase Assay
pH
7.5±n/a
Temperature
303.15±n/a K
IC50
210±n/a nM
Comments
extracted
Citation
 Burnet, MWThaher, BAEhlert, JKubbutat, MSchaechtele, CTotzke, F Kinase modulators for the treatment of cancer US Patent  US9416123 Publication Date 8/16/2016 
Target
Name:
Vascular endothelial growth factor receptor 2
Synonyms:
CD_antigen=CD309 Fetal liver kinase 1 (FLK-1) KDR Protein-tyrosine kinase receptor Flk-1 VEGFR-2 VEGFR2 Vascular Endothelial Growth Factor Receptor Kinase 2 Vascular endothelial growth factor receptor 2 (KDR) Vascular endothelial growth factor receptor 2 (VEGFR2) Vascular endothelial growth factor receptor-2 (VEGFR-2)
Type:
Receptor Tyrosine Kinase
Mol. Mass.:
151510.97
Organism:
Homo sapiens (Human)
Description:
P35968
Residue:
1356
  
Inhibitor
Name:
BDBM241822
Synonyms:
US9416123, 3a
Type:
Small organic molecule
Emp. Form.:
C12H8Cl3N3
Mol. Mass.:
300.571
SMILES:
Clc1cc(Cl)c(N\N=C\c2ccncc2)c(Cl)c1
: