Target
Serine/threonine-protein kinase B-raf [V600E]
Ligand
BDBM50379214
Substrate
Meas. Tech.
Kinase Assay
pH
7.5±n/a
Temperature
303.15±n/a K
IC50
590±n/a nM
Comments
extracted
Citation
 Burnet, MWThaher, BAEhlert, JKubbutat, MSchaechtele, CTotzke, F Kinase modulators for the treatment of cancer US Patent  US9416123 Publication Date 8/16/2016 
Target
Name:
Serine/threonine-protein kinase B-raf [V600E]
Synonyms:
B-RAF V600E B-Raf Protein Kinase Mutant (V600E) BRAF BRAF mutant V600E BRAF_HUMAN Protein mono-ADP-ribosyltransferase (PARP3) RAFB1 Serine/threonine-protein kinase B-raf (V600E) V-RAF murine sarcoma viral oncogene homologue B1 mutant (BRAF V600E)
Type:
Mol. Mass.:
84474.98
Organism:
Homo sapiens (Human)
Description:
P15056 V600E
Residue:
766
  
Inhibitor
Name:
BDBM50379214
Synonyms:
CHEMBL2011291 | US9416123, 6
Type:
Small organic molecule
Emp. Form.:
C20H12Cl3FN4
Mol. Mass.:
433.693
SMILES:
Nc1c(c(nn1-c1c(Cl)cc(Cl)cc1Cl)-c1ccncc1)-c1ccc(F)cc1
: